{"text_format":"1","workbook":"xlsx","n_sheets":7,"sheets":["DEMANDE ACHAT","REGLES D'ACHAT","AIDE CODE NACRES","NOMENCLATURE NACRE","Sous enveloppe dotation","LISTE BUDGET","CODE NACRE-marchés publics"],"not_rendered":{"charts":0,"images":3,"macros":1,"external_links":0,"defined_names":4,"comments":1,"pivot_tables":0},"unopened":[],"bounds":{"document_bytes":16777216,"sheet_cells":100000,"rows_first":2000,"rows_last":500,"rows_between":2000,"halvings":0,"cell_chars":16384,"cell_head_chars":4096},"cells_cut":0,"cells_raw":0,"read":"whole","date_system":"1900"}

{"sheet":"DEMANDE ACHAT","index":0,"n_rows":57,"n_cols":7,"rows_kept":57,"cut":false,"hidden":false,"merged":[[55,0,55,4],[56,0,56,4],[13,1,13,5],[2,1,2,5],[5,1,5,5],[54,0,54,4],[11,4,11,5],[7,4,7,5],[12,4,12,5],[17,0,17,5],[19,1,19,5]]}
[null,null,null,null,"Date : ",{"$f":"TODAY()","v":"2025-04-03"}]
[]
[null,"DEMANDE D'ACHAT"]
[]
[]
["DEMANDEUR"]
[]
["PROJET","NOM DU BUDGET",null,"TUTELLE : ",{"$f":"VLOOKUP(B8,'LISTE BUDGET'!A:J,2,FALSE)","v":"TUTELLE"}]
[]
["Sous enveloppe Dotation (INSERM et NANTES U)",null,"A compléter si budget = dotation"]
[]
["Porteur projet*",{"$f":"VLOOKUP(B8,'LISTE BUDGET'!A:J,6,FALSE)","v":"PORTEUR"},null,"PFI",{"$f":"VLOOKUP(B8,'LISTE BUDGET'!A:J,5,FALSE)","v":"PFI"}]
["*A mettre en copie de votre demande! ",null,null,"Date de fin d'engagement",{"$f":"VLOOKUP(B8,'LISTE BUDGET'!A:J,10,FALSE)","v":"DATE FIN D'ENGAGEMENT"}]
[null,"* si plusieurs projets : mettre \"MULTI-IMPUTATIONS et préciser le nom précis de chaque projet en face des lignes d'achat en colonne G            La tutelle doit impérativement être la même pour tous les projets"]
[null,"Equipement  (à cocher si votre achat concerne un achat d'équipement, Cf règles d'achat)"]
[]
["Adresse de livraison (si différente de celle du laboratoire)"]
[]
[]
["FOURNISSEUR"]
[]
["VIGILANCE MARCHES PUBLICS (voir si FOURNISSEUR OK avec le Pôle Financier) si : ",null,null,"NANTES U","INSERM","LES DEUX"]
[]
["         Pour les demandes hors offre annuelle, merci de joindre impérativement un devis"]
["REFERENCE PRODUIT","DESIGNATION PRODUIT","CODES NACRES\nFormat : XX.XX","Quantité ","Prix unitaire ","Montant HT","Multi-budgets"]
[null,null,null,null,null,{"$f":"D26*E26","v":0}]
[null,null,null,null,null,{"$f":"D27*E27","v":0}]
[null,null,null,null,null,0]
[null,null,null,null,null,0]
[null,null,null,null,null,0]
[null,null,null,null,null,0]
[null,null,null,null,null,0]
[null,null,null,null,null,0]
[null,null,null,null,null,0]
[null,null,null,null,null,0]
[null,null,null,null,null,0]
[null,null,null,null,null,0]
[null,null,null,null,null,0]
[null,null,null,null,null,0]
[null,null,null,null,null,0]
[null,null,null,null,null,0]
[null,null,null,null,null,0]
[null,null,null,null,null,0]
[null,null,null,null,null,0]
[null,null,null,null,null,0]
[null,null,null,null,null,0]
[null,null,null,null,null,0]
[null,null,null,null,null,0]
[null,null,null,null,null,0]
[null,null,null,null,null,0]
[null,null,null,null,null,0]
[null,null,null,null,null,0]
[null,null,null,null,null,0]
[null,null,null,null,null,0]
["FRAIS DE CARBOGLACE "]
["FRAIS DE PORT"]
["Montant Total HT",null,null,null,null,{"$f":"SUM(F26:F56)","v":0}]

{"sheet":"REGLES D'ACHAT","index":1,"n_rows":19,"n_cols":5,"rows_kept":19,"cut":false,"hidden":false,"merged":[[12,1,12,8],[14,4,14,8],[17,0,18,0],[15,4,15,8],[16,4,16,8],[17,4,17,8],[18,4,18,8]]}
[null,"ACHAT D'EQUIPEMENT"]
[]
[null,"Un équipement est un bien (matériel ou immatériel) qui sert de façon durable (+ de 12 mois) "]
[]
[null,"Il n'est possible de les acheter que sur budget : "]
[]
[null,"NANTES UNIVERSITE",null,null,"INSERM"]
[null,"Valeur unitaire > 800€ HT",null,null,"Valeur unitaire > 1 600€ HT"]
[]
[]
[null,"SEUIL D'ACHAT ET PROCEDURE"]
[]
[null,"** A partir de 5 000€ >> Attestations Fiscales, sociales et K-bis nécessaires (responsabilité du Pôle Financier)"]
[]
[null,"Seuil","Modalité de publicité","Type de contrat","Procédure"]
[null," - 5 000€ HT",null,"BC + CGA","Réaliser un sourcing ou procédure de demande de devis"]
[null," - 40 000€ HT",null,null,"Idem"]
["Accompagné \npar le \nPôle \nFinancier","De 40 000 à \n90 000€ HT","AAPC procédure adaptée (profil acheteur)","CCP et acte d'engagement","1/ Remplir et faire valider la fiche de financement du projet \n2/ Établir un Cahier des charges technique (cahier des clauses particulières – CCP) ;\nUne référence interne est donnée à la procédure, qui sera reprise sur l'acte d'engagement et l’ensemble des documents de la consultation (traçabilité).\n3/ Transmettre la fiche de financement et le CCP à la Direction des achats pour visa et détermination de la\nprocédure à suivre.\n4/ L’analyse et la rédaction du rapport de choix restent de la seule compétence du porteur du projet d’achat. La Direction des achats s’assure de la cohérence juridique du rapport produit.\n5/ Après achèvement de la procédure, la Direction des achats transmet une copie du marché (porteur, SFP,\nagence comptable). La commande Sifac est engagée par la composante/service, CCP saisit l’avance si elle est demandée."]
[null,"Au-dessus de \n90 000€ HT","AAPC BOAMP\n+ profil acheteur","Acte d'engagement\n+ CCAP + CCTP","1/ Remplir et faire valider la fiche de financement\n2/ Rédiger le CCTP (cahier des clauses techniques particulières)         \n3/ Transmettre le CCTP et la fiche projet validée à la Direction des achats pour engagement et lancement\nde la procédure\n4/ Après réception des offres, le porteur du projet est sollicité pour l'analyse des offres, ainsi que pour la présentation du\nprojet devant les membres de la commission des marchés\n5/ Après achèvement de la procédure, la Direction des achats transmet une copie du marché (porteur, SFP,\nagence comptable). La commande Sifac est engagée par la composante/service, CCP saisit l’avance si elle est demandée."]

{"sheet":"AIDE CODE NACRES","index":2,"n_rows":38,"n_cols":2,"rows_kept":38,"cut":false,"hidden":false,"merged":[]}
[]
["NOMENCLATURE NACRES"]
[]
["         Facilitez votre exploration sur la nomenclature en utilisant le Ctrl+F pour faire votre recherche par mots clés"]
["         CODE NACRE DISPONIBLE SUR LA PLUPART DES SITES FOURNISSEURS"]
[]
["FAMILLE D'ACHAT (en bleu les familles spécifiques aux achats recherche)"]
[]
["A","APPROVISIONNEMENT GENERAUX (restaurant, consommables, fournitures et équipement de bureau, reprographie…)"]
["B","BATIMENTS - INFRASTRUCTURES - TRAVAUX - ESPACES VERTS"]
["C","COMMUNICATION - CULTURE - DOCUMENTATION"]
["CE et CF","documentation destinée aux activités de recherche"]
["D","DEPLACEMENTS : TRANSPORT ET HEBERGEMENT DES PERSONNES"]
["E","ETUDES - CONSEILS - ASSURANCES - PI - RESSOURCES HUMAINES"]
["F","FRET / EXPEDITION / TRANSPORT / DEMENAGEMENT"]
["G","GAZ DE LABORATOIRE OU D'ATELIER + CRYOGENIE"]
["H","HYGIENE ET SECURITE AU TRAVAIL"]
["I","INFORMATIQUE - TELECOMMUNICATIONS - AUDIOVISUEL"]
["J","AMENAGEMENT DE LABORATOIRE ET DE SALLE DE TP"]
["K","EXPERIEMENTATION ANIMALE - ELEVAGE ANIMAL - CONSERVATION ANIMALE - ETUDE DES ANIMAUX"]
["L","MEDICAL (médicaments, équipements d'analyse médical …)"]
["M","MICROSCOPIE - PROFILOMETRIE"]
["N","CHIMIE BIOLOGIE"]
["NA","Produits et réactifs"]
["NB","Consommables et matériel courant de laboratoire"]
["NC","Instruments spécifiques et consommables dédiés"]
["ND","Réparation - maintenance - vérification des équipements"]
["NE","Prestations de services"]
["O","OPTIQUE - LASERS"]
["P","PHYSIQUE - PHYSIQUE NUCLEAIRE ET CORPUSCULAIRE"]
["Q","EXPERIMENTATION VEGETALE"]
["R","ATELIER - MECANIQUE - AUTOMATIQUE"]
["S","SPECTROMETRIE - SPECTROSCOPIE - RAYONS X"]
["T","ELECTRONIQUE / TEST, ENERGIE, MESURES"]
["U","SCIENCES DE LA TERRE - GEOPHYSIQUE - ASTROPHYSIQUE - ARCHEOLOGIE"]
["V","VIDE ET ULTRAVIDE : EQUIPEMENTS POUR LE VIDE ET POUR LES TECHNIQUES SOUS VIDE"]
["W","NANOTECHNOLOGIES - MICRO-ELECTRONIQUE"]
["X","DEPENSES HORS ACHATS"]

{"sheet":"NOMENCLATURE NACRE","index":3,"n_rows":2058,"n_cols":3,"rows_kept":2058,"cut":false,"hidden":false,"merged":[[0,0,0,2]]}
["Nomenclature Nacres créée avec le plan de comptes M9 => Souche Sifac"]
[]
[1,null,3]
["Codes Nacres",null,"Intitulés Nacres"]
["A",null,"APPROVISIONNEMENTS GENERAUX"]
["AA",null,"ALIMENTATION - RESTAURATION - HOTELLERIE"]
["AA.0",null,"PRODUITS ALIMENTAIRES CONGELES "]
["AA.01","N001","PAINS, PATISSERIES, VIENNOISERIES CONGELES"]
["AA.02","N002","PRODUITS CARNES CONGELES"]
["AA.03","N003","PRODUITS DE LA MER OU DEAU DOUCE CONGELES"]
["AA.04","N004","FRUITS ET LEGUMES CONGELES"]
["AA.05","N005","PREPARATIONS ALIMENTAIRES ET PLATS CUISINES CONGELES"]
["AA.1 ",null,"PRODUITS ALIMENTAIRES FRAIS"]
["AA.11","N006","PAINS, PATISSERIES, VIENNOISERIES FRAIS"]
["AA.12","N007","VIANDES FRAICHES - REFRIGEREES"]
["AA.13","N008","PRODUITS DE LA MER OU DEAU DOUCE FRAIS"]
["AA.14","N009","FRUITS ET LEGUMES FRAIS OU REFRIGERES"]
["AA.15","N010","ŒUFS ET PRODUITS LAITIERS "]
["AA.16","N011","PREPARATIONS ALIMENTAIRES ET PLATS CUISINES FRAIS - REFRIGERES"]
["AA.2",null,"BOISSONS ET EPICERIE"]
["AA.21","N012","BOISSONS NON ALCOOLISEES"]
["AA.22","N013","BOISSONS ALCOLISEES"]
["AA.23","N014","CONSERVES ET EPICERIE"]
["AA.3",null,"ALIMENTATION SPECIFIQUE"]
["AA.31","N015","ALIMENTS ADAPTES A L'ENFANT"]
["AA.32","N016","ALIMENTS DIETETIQUES SANS FIN MEDICALE"]
["AA.4",null,"PETITES FOURNITURES ET EQUIPEMENTS POUR LA RESTAURATION"]
["AA.41","N017","CONSOMMABLES POUR LA RESTAURATION"]
["AA.42","N018","PETITES FOURNITURES POUR LA RESTAURATION"]
["AA.43","N019","MOBILIER DE CUISINE ET DE SALLE DE RESTAURATION"]
["AA.44","N020","EQUIPEMENTS DE CUISINE ET DE SALLE DE RESTAURATION (ELECTROMENAGER,…)"]
["AA.5",null,"PETITES FOURNITURES ET EQUIPEMENTS POUR L'HOTELLERIE ET LA BUANDERIE"]
["AA.51","N021","PETITES FOURNITURES POUR L'HOTELLERIE"]
["AA.52","N022","MOBILIER D'HOTELLERIE"]
["AA.53","N023","EQUIPEMENT POUR L'HOTELLERIE ET LA BUANDERIE"]
["AA.6",null,"SERVICES DE RESTAURATION ET SERVICES CONNEXES"]
["AA.61","N024","SERVICES DE RESTAURATION SOCIALE (RESTAURANT PROPRE A GESTION CONCEDEE)"]
["AA.62","N025","TICKETS ET CHEQUES REPAS"]
["AA.63","N026","SERVICES DE TRAITEURS / PLATEAUX REPAS"]
["AA.64","N027","SERVICES DE RESTAURATION EXTERIEURS (RESTAURANTS)"]
["AA.65","N028","SERVICES DE CONTROLES SANITAIRES ET DE QUALITE"]
["AA.66","N029","SERVICES DE BLANCHISSERIE- PRESSING POUR LA RESTAURATION ET L'HOTELLERIE"]
["AA.7",null,"REPARATION ET MAINTENANCE DES EQUIPEMENTS DE RESTAURATION ET HOTELLERIE"]
["AA.71","N030","REPARATION ET MAINTENANCE DES EQUIPEMENTS DE RESTAURATION ET DE CUISINE"]
["AA.72","N031","REPARATION ET MAINTENANCE DES EQUIPEMENTS D'HOTELLERIE ET BUANDERIE"]
["AB",null,"BUREAU (HORS INFORMATIQUE)"]
["AB.0 ",null,"CONSOMMABLES, FOURNITURES ET EQUIPEMENTS DE BUREAU"]
["AB.01","N032","PETITES FOURNITURES ET PETITS EQUIPEMENTS DE BUREAU (HORS INFORMATIQUE)"]
["AB.02","N033","MOBILIER DE BUREAU ET DE SALLES DE REUNION"]
["AB.03","R446","MOBILIER ET EQUIPEMENTS SPECIFIQUES ERGONOMIQUES"]
["AB.1",null,"REPARATION ET MAINTENANCE DU MOBILIER ET DES EQUIPEMENTS DE BUREAU ET DE SALLE DE REUNION"]
["AB.11","N034","REPARATION ET MAINTENANCE DES EQUIPEMENTS DE BUREAU ET DE SALLE DE REUNION"]
["AB.12","Z148","REPARATION ET MAINTENANCE DES EQUIPEMENTS SPECIFIQUES ERGONOMIQUES"]
["AC",null,"IMPRESSION-REPROGRAPHIE"]
["AC.0",null,"PAPIERS ET CARTONS D'IMPRESSION-REPROGRAPHIE"]
["AC.01","N035","PAPIERS BLANCS OU COLORES COURANTS POUR IMPRESSION-REPROGRAPHIE"]
["AC.02","N036","PAPIERS CARTONNES POUR IMPRESSION-REPROGRAPHIE"]
["AC.03","N037","AUTRES SUPPORTS PAPIER SPECIFIQUES D'IMPRESSION-REPROGRAPHIE"]
["AC.1",null,"CONSOMMABLES POUR LA REPROGRAPHIE"]
["AC.11","N038","CONSOMMABLES POUR PHOTOCOPIEURS (ENCRES, AGRAPHES,…)"]
["AC.12","N039","SUPPORTS SPECIFIQUES D'IMPRESSION"]
["AC.2",null,"EQUIPEMENTS POUR REPROGRAPHIE"]
["AC.21","N040","EQUIPEMENTS DE REPROGRAPHIE DE PROXIMITE"]
["AC.22","N041","EQUIPEMENTS DE REPROGRAPHIE HAUT DEBIT POUR IMPRIMERIE"]
["AC.23","N042","AUTRES EQUIPEMENTS POUR ATELIER DE REPROGRAPHIE"]
["AC.3",null,"SERVICES D'IMPRESSION ET DE REPROGRAPHIE"]
["AC.31","N043","SERVICES EXTERNALISES D'IMPRESSION ET DE REPROGRAPHIE"]
["AC.4",null,"REPARATION ET MAINTENANCE DES EQUIPEMENTS DE REPROGRAPHIE"]
["AC.41","N044","REPARATION ET MAINTENANCE DES EQUIPEMENTS DE REPROGRAPHIE DE PROXIMITE"]
["AC.42","N045","REPARATION ET MAINTENANCE DES EQUIPEMENTS DE REPROGRAPHIE HAUT DEBIT"]
["AC.43","N046","REPARATION ET MAINTENANCE DES AUTRES EQUIPEMENTS D'ATELIER DE REPROGRAPHIE"]
["AD",null,"PARC DE VEHICULES"]
["AD.0",null,"FOURNITURES, CONSOMMABLES ET PETITS EQUIPEMENTS POUR LE PARC DE VEHICULES"]
["AD.01","N047","ACCESSOIRES ET PIECES DETACHEES POUR LE PARC DE VEHICULES"]
["AD.02","N048","MATERIEL, OUTILLAGE ET EQUIPEMENTS DE GARAGE "]
["AD.03","N049","PRODUITS POUR L'ENTRETIEN DES VEHICULES"]
["AD.04","N050","MATERIEL D'ESSAIS DE CHOCS ET ACCESSOIRES"]
["AD.1",null,"PARC VEHICULE (ACHAT OU LOCATION DE LONGUE DUREE)"]
["AD.11","N051","VEHICULES AUTOMOBILES DE TRANSPORT DE PERSONNES (ACHAT OU LOC. LONGUE DUREE)"]
["AD.12","N052","VEHICULES AUTOMOBILES DE TRANSPORT EN COMMUN (ACHAT OU LOC. LONGUE DUREE)"]
{"$rows_left_out":1979}
{"sheet":"Sous enveloppe dotation","index":4,"n_rows":8,"n_cols":1,"rows_kept":8,"cut":false,"hidden":true,"merged":[]}
["A compléter si budget = dotation"]
["HYGIENE ET SECURITE"]
["LAB-MANAGER"]
["GREEN LAB"]
["EVENEMENTS LABO"]
["COMITE DES SEMINAIRES"]
["THESE"]
["FRAIS DE REPRESENTATION"]

{"sheet":"LISTE BUDGET","index":5,"n_rows":201,"n_cols":10,"rows_kept":201,"cut":false,"hidden":true,"merged":[]}
["NOM DU BUDGET","TUTELLE","EQUIPE ","GROUPE ","PFI","PORTEUR","TYPE","DATE DEBUT ELIGIBILITE DE DEPENSES","DATE FIN ELIGIBILITE DE DEPENSES","DATE FIN D'ENGAGEMENT"]
["MULTI IMPUTATION",null,null,null,null,null,null,null,null,{"$f":"IF(I2=0,\"cf détail Budget\",EDATE(I2,-3))","v":"cf détail Budget"}]
["DOTATION UNIV","NANTES UNIVERSITE","DIRECTION","DIRECTION","2226CSUR1229","JEROME GUICHEUX / CATHERINE LEVISAGE","PLURI","2022-01-01","2027-12-31",{"$f":"IF(I3=0,\"Epuisement des fonds\",EDATE(I3,-3))","v":"2027-09-30"}]
["DOTATION INSERM","INSERM","DIRECTION","DIRECTION","NA /  CC : NU1229","JEROME GUICHEUX / CATHERINE LEVISAGE","ANNUEL","2025-01-01","2025-12-31","2025-09-30"]
["DOTATION REJOINT","INSERM","DIRECTION","DIRECTION","3U1229E001SEREJOIN","JEROME GUICHEUX","ANNUEL","2025-01-01","2025-12-31","2025-09-30"]
["DOTATION REGOS","INSERM","DIRECTION","DIRECTION","3U1229E002SEREGOS-","PIERRE WEISS","ANNUEL","2025-01-01","2025-12-31","2025-09-30"]
["Frais de Gestion - Contrats RECH","NANTES UNIVERSITE","DIRECTION","DIRECTION","24PRLTCT1229","JEROME GUICHEUX / CATHERINE LEVISAGE","PLURI","2024-01-01","2026-12-31","2026-09-30"]
["CPCC Romain GUIHO","NANTES UNIVERSITE","REJOINT","AGE-OA","2226CSUR1229","Romain GUIHO","PLURI","2022-01-01","2027-12-31","2027-09-30"]
["CPCC Anaïs CARDON","NANTES UNIVERSITE","REJOINT","STRATOA","2226CSUR1229","Anaïs CARDON","PLURI","2022-01-01","2027-12-31","2027-09-30"]
["CPCC Alexandra CLOITRE","NANTES UNIVERSITE","REGOS","INFLAMED","2226CSUR1229","ALEXANDRA CLOITRE","PLURI","2022-01-01","2027-12-31","2027-09-30"]
["CPCC Alexis GAUDIN","NANTES UNIVERSITE","REGOS","INFLAMED","2226CPCCGAUDIN","ALEXIS GAUDIN","PLURI","2022-01-01","2027-12-31","2027-09-30"]
["CPCC Yoan LEGUENNEC","NANTES UNIVERSITE","PF","PF","2226CPCCLEGUENNEC","YOAN LEGUENNEC","PLURI","2022-01-01","2027-12-31","2027-09-30"]
["ANR CONGOS","NANTES UNIVERSITE","REGOS","MATOS","21CONGOS","PIERRE WEISS","PLURI","2020-10-01","2025-09-30","2025-06-30"]
["Prix LESPITAU","NANTES UNIVERSITE","REJOINT","JG","21LESPIT","JEROME GUICHEUX","PLURI","2021-09-01",null,"Epuisement des fonds"]
["ANR METAB-OA","NANTES UNIVERSITE","REJOINT","HEAL","21METABO","CATHERINE LEVISAGE","PLURI","2020-10-01","2025-09-30","2025-06-30"]
["ANR OVERBONE","NANTES UNIVERSITE","REGOS","EPIGEN","21OVERBO","VALERIE GEOFFROY","PLURI","2020-10-01","2025-12-31","2025-09-30"]
["BONE HEALTH","NANTES UNIVERSITE","REGOS","MATOS","22BONEHE","VALERIE TRICHET","PLURI","2021-10-01","2025-09-30","2025-06-30"]
["CREABONE","NANTES UNIVERSITE","REGOS","MATOS","22CREABO","PIERRE WEISS","PLURI","2021-10-01","2025-10-31","2025-07-31"]
["DISCAFF","NANTES UNIVERSITE","REJOINT","HEAL","22DISCAF","JEROME GUICHEUX","PLURI","2022-03-01","2026-02-28","2025-11-28"]
["GRAPH OCD","NANTES UNIVERSITE","REJOINT","HEAL","23GRAPHO","CATHERINE LEVISAGE","PLURI","2023-12-01","2027-01-31","2026-10-31"]
["EVAGOS","NANTES UNIVERSITE","REGOS","MATOS","22EVAGOS","ASSEM SOUEIDAN","PLURI","2022-01-17","2025-12-03","2025-09-03"]
["Prix G. PIEL","NANTES UNIVERSITE","REJOINT","JG","22GUPIEL","JEROME GUICHEUX","PLURI","2022-12-01","2025-12-31","2025-09-30"]
["IDEAL 3D","NANTES UNIVERSITE","REGOS","INFLAMED","22IDEAL3","ALEXANDRA CLOITRE","PLURI","2021-10-01","2025-12-31","2025-09-30"]
["ANR NEMESIS","NANTES UNIVERSITE","REJOINT","HEAL","22NEMESI","JOHANN CLOUET","PLURI","2023-03-01","2027-02-28","2026-11-28"]
["REGION NEMESI","NANTES UNIVERSITE","REJOINT","HEAL","22NEMESI","JOHANN CLOUET","PLURI","2023-03-01","2027-02-28","2026-11-28"]
["Thèse Garance St Pé","NANTES UNIVERSITE","REJOINT","BIOMAX","22SAINPE","VIANNEY DELPLACE","PLURI","2022-09-23","2025-12-31","2025-09-30"]
["COBIOSTEM","NANTES UNIVERSITE","REJOINT","BIOMAX","23COBIOS","VIANNEY DELPLACE","PLURI","2022-10-01","2026-01-31","2025-10-31"]
["DISPHPE","NANTES UNIVERSITE","REJOINT","BIODIV","23DISPHP","ANNE CAMUS","PLURI","2023-03-01","2028-02-28","2027-11-28"]
["DYNAM-OA","NANTES UNIVERSITE","REJOINT","BIOMAX","23DYNAMO","VIANNEY DELPLACE","PLURI","2022-10-01","2027-01-31","2026-10-31"]
["PULSAR - S SERISIER","NANTES UNIVERSITE","PRE CLINICAL","PRE CLINICAL","23PULSAR","SAMUEL SERISIER","PLURI","2023-07-06","2025-07-06","2025-04-06"]
["PULSAR - G RETHORE","NANTES UNIVERSITE","REGOS","MATOS","23PULSAR","GILDAS RETHORE","PLURI","2023-07-06","2025-07-06","2025-04-06"]
["SMARTIES","NANTES UNIVERSITE","REJOINT","HEAL","23SMARTI","CATHERINE LEVISAGE","PLURI","2023-03-01","2027-02-28","2026-11-28"]
["SPOTT","NANTES UNIVERSITE","REJOINT","STRATOA","23SPOTTE","MARIE-ASTRID BOUTET","PLURI","2023-09-06","2025-06-06","2025-03-06"]
["DONS 2023 COMBAT DE LULU","NANTES UNIVERSITE","REGOS","MATOS","DONDELUL","VALERIE TRICHET","PLURI","2023-06-01","2025-12-31","2025-09-30"]
["DONS 2024 COMBAT DE LULU","NANTES UNIVERSITE","REGOS","MATOS","24DONSVT","VALERIE TRICHET","PLURI","2024-11-01",null,"Epuisement des fonds"]
["PEPR CARN","NANTES UNIVERSITE","REJOINT","AGE-OA","PEPRCARN","JEROME GUICHEUX","PLURI","2023-06-01","2027-05-31","2027-02-28"]
["PVNS","NANTES UNIVERSITE","REJOINT","T-SYNO","24ANRPVN","FREDERIC BLANCHARD","PLURI","2023-12-01","2027-11-30","2027-08-30"]
["TARGET-OA","NANTES UNIVERSITE","REJOINT","AGE-OA","24TARGET","CLAIRE VINATIER","PLURI","2024-04-01","2028-03-31","2027-12-31"]
["TARMAC","NANTES UNIVERSITE","REJOINT","STRATOA","24TARMAC","MARIE-ASTRID BOUTET","PLURI","2024-09-02","2027-09-01","2027-06-01"]
["OLYMPIC","NANTES UNIVERSITE","REJOINT","STRATOA","24OLYMPI","MARIE-ASTRID BOUTET","PLURI","2024-05-01","2027-04-30","2027-01-30"]
["SPHERODISC","NANTES UNIVERSITE","REJOINT","BIODIV","24SFRCAM","ANNE CAMUS","PLURI",null,null,"Epuisement des fonds"]
["ICEBERG","NANTES UNIVERSITE","REGOS","MATOS","24ICEBER","PIERRE WEISS / PIERRE GUIHARD","PLURI","2025-01-01","2028-09-30","2028-06-30"]
["GUEULES CASSEES P CORRE","NANTES UNIVERSITE","REGOS","MATOS","24GCCORR","PIERRE MAITRE/PIERRE CORRE","PLURI","2024-09-01","2025-07-31","2025-04-30"]
["FRAIS DE GESTION CAPACITES","NANTES UNIVERSITE","DIRECTION","DIRECTION","25FGCAPA","JEROME GUICHEUX / CATHERINE LEVISAGE","ANNUEL","2025-01-01","2025-12-31","2025-09-30"]
["CONTRAT REVERSEMENT CAPACITES","NANTES UNIVERSITE","DIRECTION","DIRECTION","25CSCAPA","JEROME GUICHEUX / CATHERINE LEVISAGE","ANNUEL","2025-01-01","2025-12-31","2025-09-30"]
["MAD ANR JGUICHEUX","INSERM","DIRECTION","JG","1RPV22130NTENTEA01","JEROME GUICHEUX / ROMAIN GUIHO","PLURI","2021-10-01",null,"Epuisement des fonds"]
["DOTATION ONIRIS","INSERM","DIRECTION","DIRECTION","1RPK24205NTENTEA01","MARION FUSELIER","PLURI","2024-03-31","2026-06-30","2026-03-30"]
["THESE N GAIGEARD (REGION)","INSERM","REJOINT","STRATOA","1RPH22193NTENTEA01","MARIE-ASTRID BOUTET","PLURI","2022-10-01","2025-09-30","2025-06-30"]
["PULSAR STRATOA","INSERM","REJOINT","STRATOA","1RPH23164NTENTEA01","MARIE-ASTRID BOUTET","PLURI","2023-10-01","2025-09-30","2025-06-30"]
["ATIP AVENIR MAB","INSERM","REJOINT","STRATOA","1RSE22003NTEDGEA01","MARIE-ASTRID BOUTET","ANNUEL","2025-01-01","2025-12-31","2025-09-30"]
["ATIP AVENIR BC","INSERM","REGOS","SAMBA","1RSE23004NTEDGEA01","BAPTISTE CHARBONNIER","ANNUEL","2025-01-01","2025-12-31","2025-09-30"]
["DOTATION JC / B CHARBONNIER","INSERM","REGOS","SAMBA","4BSHARNR25SENU1229","BAPTISTE CHARBONNIER","ANNUEL","2025-01-01","2025-12-31","2025-09-30"]
["GLYCODISC","INSERM","REJOINT","HEAL","1RSE22060NTENTEA01","CATHERINE LEVISAGE","ANNUEL","2025-01-01","2025-12-31","2025-09-30"]
["NEXT BIOCARD","INSERM","REJOINT","STRATOA","1RGE23108NTENTEA01","JEROME GUICHEUX / MARIE-ASTRID BOUTET","PLURI","2023-07-01","2026-12-31","2026-09-30"]
["CAPA PFSC3M MEB","CAPACITES","PF","PF","PFSC3MM2","JOELLE VEZIERS",null,null,null,"Epuisement des fonds"]
["UNIV PF MEB","NANTES UNIVERSITE","PF","PF","25PFMEB2","JOELLE VEZIERS","ANNUEL","2025-01-01","2025-12-31","2025-09-30"]
["CAPA PFSC3M HISTOLOGIE","CAPACITES","PF","PF","PFSC3MHISTO","YOAN LEGUENNEC",null,null,null,"Epuisement des fonds"]
["UNIV PF HISTOLOGIE","NANTES UNIVERSITE","PF","PF","25PFHIST","YOAN LEGUENNEC","ANNUEL","2025-01-01","2025-12-31","2025-09-30"]
["CAPA PF CCELL","CAPACITES","PF","PF","PFRMESCCELL","BORIS HALGAND",null,null,null,"Epuisement des fonds"]
["UNIV PF CCELL","NANTES UNIVERSITE","PF","PF","25PFCCEL","BORIS HALGAND","ANNUEL","2025-01-01","2025-12-31","2025-09-30"]
["CAPA PFBIO3","CAPACITES","PF","PF","PFBIO3COMMUN","FRANCOIS LOLL",null,null,null,"Epuisement des fonds"]
["CAPA PF INOA","CAPACITES","PF","PF","PFRMESINOA","SOPHIE ALLAIN",null,null,null,"Epuisement des fonds"]
["UNIV PF INOA","NANTES UNIVERSITE","PF","PF","25PFINOA","SOPHIE ALLAIN","ANNUEL","2025-01-01","2025-12-31","2025-09-30"]
["CAPA BIOMOL","CAPACITES","PF","PF","PFRMESBIOMOL","MARIELLE TALLEGAS",null,null,null,"Epuisement des fonds"]
["UNIV BIOMOL","NANTES UNIVERSITE","PF","PF","25PFBIOM","MARIELLE TALLEGAS","ANNUEL","2025-01-01","2025-12-31","2025-09-30"]
["CAPA PFRMES AC","CAPACITES","PF","PF","PFRMESAC","ANNE CAMUS",null,null,null,"Epuisement des fonds"]
["CAPA PFRMES CLV","CAPACITES","PF","PF","PFRMESCLV","CATHERINE LEVISAGE",null,null,null,"Epuisement des fonds"]
["CAPA PF RMES FEOM","CAPACITES","PF","PF","PFRMESFEOM","JEROME GUICHEUX / CATHERINE LEVISAGE",null,null,null,"Epuisement des fonds"]
["CAPA PFRMES PHI","CAPACITES","PF","PF","PFRMESPHI","PHILIPPE LESCLOUS",null,null,null,"Epuisement des fonds"]
["CAPA PFRMES JCL","CAPACITES","PF","PF","PFRMESJCL","JOHANN CLOUET",null,null,null,"Epuisement des fonds"]
["CAPA PFRMES JG","CAPACITES","PF","PF","PFRMESJG","JEROME GUICHEUX",null,null,null,"Epuisement des fonds"]
["CAPA LAB COM GELMECS","CAPACITES","REGOS","MATOS","202011496HT01","PIERRE WEISS","PLURI","2020-01-01","2025-12-31","2025-09-30"]
["CAPA GLIOCURE","CAPACITES","PF","PF","202011274GL01","FRANCOIS LOLL",null,null,null,"Epuisement des fonds"]
["CAPA CIFRE - AMS BIOMATLANTE","CAPACITES","EXT","EXT","2023-14972 BI","CYRIL D'ARROS",null,null,null,{"$f":"IF(I74=0,\"Epuisement des fonds\",EDATE(I74,-3))","v":"Epuisement des fonds"}]
["FOND AVENIR B LEGOFF","FONDATION DE L'AVENIR","REJOINT","T-SYNO","AP-RM-23-008","BENOIT LEGOFF","PLURI","2024-09-05","2025-12-13","2025-09-13"]
["FOND AVENIR C DARRIEUTORT","FONDATION DE L'AVENIR","REJOINT","T-SYNO","AP-RM-24-005","CHRISTELLE DARRIEUTORT","PLURI","2025-03-01","2026-09-01","2026-06-01"]
["INCA O MALARD","NANTES UNIVERSITE","REGOS","PRE CLINICAL","25SEQRTH","OLIVIER MALARD","PLURI","2023-04-14","2028-04-13","2028-01-13"]
["NEXT I AMI","NANTES UNIVERSITE","REGOS","MATOS","24X2DECI","GILDAS RETHORE","PLURI","2024-04-01","2027-12-31","2027-09-30"]
["PULSAR BAPTISTE CHARBONNIER","INSERM","REGOS","SAMBA","1RPH24146NTENTEA01","BAPTISTE CHARBONNIER","PLURI","2024-06-05","2026-06-04","2026-03-04"]
[null,null,null,null,null,null,null,null,null,"Epuisement des fonds"]
{"$rows_left_out":122}
{"sheet":"CODE NACRE-marchés publics","index":6,"n_rows":311,"n_cols":5,"rows_kept":311,"cut":false,"hidden":true,"merged":[]}
["Liste des marchés transversaux actifs NANTES UNIVERSITE >>",null,null,null,"MARCHES ACTIFS"]
["Liste des marchés transversaux actifs INSERM >>  CRONOS\\RMES_GESTIONFIN3\\2-INSERM\\__PROCEDURES\\3-MARCHES PUBLICS"]
[]
["CODE NACRES"]
["NANTES UNIVERSITE","INSERM"]
["AA.63","AB.01"]
["AB.01","AC.01"]
["AB.02","AC.11"]
["AB.03","BA.01"]
["AB.11","BA.02"]
["AB.12","BB.33 "]
["AC.01","BE.11"]
["AC.02","CA.11"]
["AC.03","CA.13"]
["AC.21","CE.11 "]
["AC.22","CE.12"]
["AC.41","CE.13"]
["AC.42","CE.14"]
["AF.01","CE.21"]
["BA.01","CF.03"]
["BA.02","CI.11"]
["BA.05","DC. 01"]
["BB.01","DC.11"]
["BB.02","EA.21"]
["BB.11","EA.22 "]
["BB.13","EB.06"]
["BB.31","EB.13 "]
["BB.32","EB.31"]
["BC.01","ED.03"]
["BC.02","FB.03"]
["BC.12","FB.06"]
["BD.02","FC.13"]
["BD.04","HA.01"]
["BD.15","HA.02"]
["BD.21","HA.03"]
["BD.22","HA.04"]
["BE.02","HA.05"]
["BE.11","HA.06"]
["BE.13","HA.07"]
["BE.14","HA.11"]
["BE.15","HA.12"]
["BG.21","HA.21"]
["CA.01","HA.22"]
["CA.31","HA.23"]
["CA.32","HA.24"]
["CA.33","IA.01 "]
["CB.12","IA.11 "]
["CB.21","IA.12"]
["CB.23","IA.22"]
["CE.01","IA.23"]
["CE.02","IA.24"]
["CE.03","IA.31"]
["CE.04","IA.32"]
["CE.11","IA.33"]
["CE.12","IB.01"]
["CE.13","IB.05 "]
["CE.14","IB.06"]
["CG.11","IB.11"]
["CG.12","IB.13"]
["DA.02","IB.32"]
["DA.11","IB.41"]
["DB.11","IB.42"]
["DC.01","IB.43"]
["DC.11","IB.52"]
["EA.12","IC.22"]
["FA.11","ID.13"]
["FC.11","ID.18"]
["FD.01","ID.31 "]
["FD.11","ID.33"]
["GA.09","ID.43"]
["GA.41","ID.44"]
["GC.02","ID.45"]
["HA.01","ID.51 "]
["HA.02","ID.52 "]
["HA.03","ID.53"]
["HA.04","ID.76"]
["HA.05","IG.01"]
["HA.06","IG.01 "]
["HA.07","IH.01"]
["HA.11","II.01"]
{"$rows_left_out":231}